ACCESSION: MSBNK-Fac_Eng_Univ_Tokyo-JP009173
RECORD_TITLE: P-PROPYLANISOLE; EI-B; MS
DATE: 2016.01.19 (Created 2008.10.21, modified 2011.05.06)
AUTHORS: SODA AROMATIC CO., LTD.
LICENSE: CC BY-NC-SA

CH$NAME: P-PROPYLANISOLE
CH$COMPOUND_CLASS: N/A
CH$FORMULA: C10H14O
CH$EXACT_MASS: 150.10447
CH$SMILES: CCCc(c1)ccc(OC)c1
CH$IUPAC: InChI=1S/C10H14O/c1-3-4-9-5-7-10(11-2)8-6-9/h5-8H,3-4H2,1-2H3
CH$LINK: INCHIKEY KBHWKXNXTURZCD-UHFFFAOYSA-N
CH$LINK: COMPTOX DTXSID0042325

AC$INSTRUMENT: HITACHI M-80B
AC$INSTRUMENT_TYPE: EI-B
AC$MASS_SPECTROMETRY: MS_TYPE MS
AC$MASS_SPECTROMETRY: ION_MODE POSITIVE
AC$MASS_SPECTROMETRY: IONIZATION_ENERGY 70 eV

MS$FOCUSED_ION: ION_TYPE [M]+*

PK$SPLASH: splash10-00di-4900000000-22bc0f8539c6db1ca5ad
PK$NUM_PEAK: 22
PK$PEAK: m/z int. rel.int.
  15 1.82 18
  27 4.61 46
  29 2.87 29
  39 4.52 45
  41 2.29 23
  50 1.41 14
  51 4.62 46
  52 2.5 25
  53 1.41 14
  63 2.24 22
  64 1.07 11
  65 4.94 49
  77 8.98 90
  78 9.93 99
  79 1.55 16
  89 1.72 17
  90 1.24 12
  91 7.33 73
  121 99.99 999
  122 8.08 81
  150 18.17 182
  151 1.68 17