ACCESSION: MSBNK-Fac_Eng_Univ_Tokyo-JP005470
RECORD_TITLE: N,N'-DIMETHYL-2,2'-BIPYRROLIDINE; EI-B; MS
DATE: 2016.01.19 (Created 2008.10.21, modified 2011.05.06)
AUTHORS: HIRAMA M, TOHOKU UNIV. FACULTY OF SCIENCE DEPT. OF CHEMISTRY YUKIBUNSEKI
LICENSE: CC BY-NC-SA

CH$NAME: N,N'-DIMETHYL-2,2'-BIPYRROLIDINE
CH$COMPOUND_CLASS: N/A
CH$FORMULA: C10H20N2
CH$EXACT_MASS: 168.16265
CH$SMILES: CN(C2)C(CC2)C(C1)N(C)CC1
CH$IUPAC: InChI=1S/C10H20N2/c1-11-7-3-5-9(11)10-6-4-8-12(10)2/h9-10H,3-8H2,1-2H3
CH$LINK: INCHIKEY CUUDITMQWYGVGB-UHFFFAOYSA-N

AC$INSTRUMENT: HITACHI M-52
AC$INSTRUMENT_TYPE: EI-B
AC$MASS_SPECTROMETRY: MS_TYPE MS
AC$MASS_SPECTROMETRY: ION_MODE POSITIVE
AC$MASS_SPECTROMETRY: IONIZATION_ENERGY 25 eV

MS$FOCUSED_ION: ION_TYPE [M]+*

PK$SPLASH: splash10-001i-9200000000-062205346eee64337ccb
PK$NUM_PEAK: 4
PK$PEAK: m/z int. rel.int.
  57 2.87 29
  70 43.3 433
  84 99.99 999
  113 43.36 434