ACCESSION: MSBNK-Fac_Eng_Univ_Tokyo-JP004844
RECORD_TITLE: (1R*,2R*,11R*,14S*)-1,14-EPOXY-4,8,14,15,15-PENTAMETHYLBICYCLO(9.3.1)PENTADECA-4(E),8(E)-DIEN-2-YLMETHANOL; EI-B; MS
DATE: 2016.01.19 (Created 2008.10.21, modified 2011.05.06)
AUTHORS: KATO T, DEPT. OF CHEM., FAC. OF SCI., TOHOKU UNIV.
LICENSE: CC BY-NC-SA

CH$NAME: (1R*,2R*,11R*,14S*)-1,14-EPOXY-4,8,14,15,15-PENTAMETHYLBICYCLO(9.3.1)PENTADECA-4(E),8(E)-DIEN-2-YLMETHANOL
CH$COMPOUND_CLASS: N/A
CH$FORMULA: C21H34O2
CH$EXACT_MASS: 318.25588
CH$SMILES: N/A
CH$IUPAC: N/A

AC$INSTRUMENT: Unknown
AC$INSTRUMENT_TYPE: EI-B
AC$MASS_SPECTROMETRY: MS_TYPE MS
AC$MASS_SPECTROMETRY: ION_MODE POSITIVE
AC$MASS_SPECTROMETRY: IONIZATION_ENERGY 14 eV

MS$FOCUSED_ION: ION_TYPE [M]+*

PK$SPLASH: splash10-0kar-2920000000-939bbd1abcce06747f7d
PK$NUM_PEAK: 75
PK$PEAK: m/z int. rel.int.
  57 13.9 139
  59 3.9 39
  69 7.4 74
  80 0.16 2
  81 5.5 55
  83 10 100
  84 22.2 222
  86 6.29 63
  93 1.9 19
  94 9.4 94
  95 13.5 135
  97 0.59 6
  98 24.2 242
  107 41.1 411
  108 4.7 47
  110 0.13 1
  114 11.4 114
  116 55.9 559
  117 6.1 61
  119 0.13 1
  120 6.3 63
  121 18.8 188
  123 14.1 141
  124 0.23 2
  131 2.7 27
  133 3.9 39
  134 71.2 712
  135 99.99 999
  136 11.9 119
  137 9.8 98
  138 3.3 33
  139 0.43 4
  145 10 100
  146 7.8 78
  147 1.7 17
  148 3.63 36
  149 21.5 215
  150 2.3 23
  153 2.7 27
  155 1.5 15
  156 3.1 31
  157 41.4 414
  159 2.9 29
  160 1.37 14
  161 22 220
  164 2.1 21
  165 6.2 62
  173 0.7 7
  175 1.4 14
  176 4.7 47
  177 7.2 72
  181 0.35 4
  182 10.7 107
  183 2.4 24
  185 2.1 21
  189 1.66 17
  190 2 20
  201 4.7 47
  202 24.2 242
  213 0.14 1
  219 3.4 34
  227 4.6 46
  232 23.2 232
  233 0.16 2
  242 1.3 13
  245 2.4 24
  250 63.3 633
  251 0.77 8
  255 14.9 149
  270 17.9 179
  273 4.3 43
  288 1.52 15
  303 1.5 15
  317 3.5 35
  318 4.6 46