ACCESSION: MSBNK-Fac_Eng_Univ_Tokyo-JP004168
RECORD_TITLE: N-(2-CHLOROETHYL)-2-PYRROLIDONE; EI-B; MS
DATE: 2016.01.19 (Created 2008.10.21, modified 2011.05.06)
AUTHORS: MASS SPECTROSCOPY SOC. OF JAPAN (MSSJ)
LICENSE: CC BY-NC-SA

CH$NAME: N-(2-CHLOROETHYL)-2-PYRROLIDONE
CH$COMPOUND_CLASS: N/A
CH$FORMULA: C6H10ClNO
CH$EXACT_MASS: 147.04509
CH$SMILES: ClCCN(C1)C(=O)CC1
CH$IUPAC: InChI=1S/C6H10ClNO/c7-3-5-8-4-1-2-6(8)9/h1-5H2
CH$LINK: INCHIKEY CWLYHDWHNFLUEI-UHFFFAOYSA-N
CH$LINK: COMPTOX DTXSID90390083

AC$INSTRUMENT: HITACHI RMU-6E
AC$INSTRUMENT_TYPE: EI-B
AC$MASS_SPECTROMETRY: MS_TYPE MS
AC$MASS_SPECTROMETRY: ION_MODE POSITIVE
AC$MASS_SPECTROMETRY: IONIZATION_ENERGY 70 eV

MS$FOCUSED_ION: ION_TYPE [M]+*

PK$SPLASH: splash10-0002-9100000000-2d9cb0140b22c161c54b
PK$NUM_PEAK: 73
PK$PEAK: m/z int. rel.int.
  26 3.2 32
  27 15.6 156
  28 22 220
  29 0.24 2
  30 3.5 35
  31 0.2 2
  32 0.3 3
  36 0.05 1
  37 0.3 3
  38 0.8 8
  39 7.2 72
  40 0.29 3
  41 26 260
  42 17.4 174
  43 8.2 82
  44 0.2 2
  45 0.1 1
  47 0.1 1
  48 0.2 2
  49 0.16 2
  50 0.3 3
  51 0.8 8
  52 0.9 9
  53 0.08 1
  54 2.4 24
  55 3.1 31
  56 8 80
  57 0.29 3
  58 0.7 7
  61 0.5 5
  62 0.6 6
  63 0.4 4
  64 0.4 4
  65 1.3 13
  66 0.3 3
  67 0.06 1
  68 5.2 52
  69 19 190
  70 41 410
  71 0.21 2
  79 0.1 1
  80 0.7 7
  81 0.1 1
  82 0.1 1
  83 0.7 7
  84 4 40
  85 1.4 14
  86 0.05 1
  88 0.2 2
  89 0.1 1
  90 0.7 7
  91 0.01 0
  92 2.7 27
  93 0.1 1
  94 0.9 9
  95 0.01 0
  96 0.2 2
  97 0.1 1
  98 99.99 999
  99 0.7 7
  100 0.4 4
  110 0.1 1
  111 0.3 3
  112 0.54 5
  113 0.4 4
  118 0.4 4
  120 0.1 1
  146 0.12 1
  147 23 230
  148 2.7 27
  149 8.2 82
  150 0.07 1
  151 0.1 1