ACCESSION: MSBNK-Fac_Eng_Univ_Tokyo-JP003991
RECORD_TITLE: N,N-DIETHYLANILINE; EI-B; MS
DATE: 2016.01.19 (Created 2008.10.21, modified 2011.05.06)
AUTHORS: MASS SPECTROSCOPY SOC. OF JAPAN (MSSJ)
LICENSE: CC BY-NC-SA

CH$NAME: N,N-DIETHYLANILINE
CH$COMPOUND_CLASS: N/A
CH$FORMULA: C10H15N
CH$EXACT_MASS: 149.12045
CH$SMILES: CCN(CC)c(c1)cccc1
CH$IUPAC: InChI=1S/C10H15N/c1-3-11(4-2)10-8-6-5-7-9-10/h5-9H,3-4H2,1-2H3
CH$LINK: INCHIKEY GGSUCNLOZRCGPQ-UHFFFAOYSA-N
CH$LINK: COMPTOX DTXSID8021800

AC$INSTRUMENT: HITACHI RMU-6L
AC$INSTRUMENT_TYPE: EI-B
AC$MASS_SPECTROMETRY: MS_TYPE MS
AC$MASS_SPECTROMETRY: ION_MODE POSITIVE
AC$MASS_SPECTROMETRY: IONIZATION_ENERGY 70 eV

MS$FOCUSED_ION: ION_TYPE [M]+*

PK$SPLASH: splash10-053r-2900000000-c6d7a5eadc7902c2b8d5
PK$NUM_PEAK: 8
PK$PEAK: m/z int. rel.int.
  28 10 100
  51 10.7 107
  77 30.1 301
  79 1.1 11
  104 12 120
  106 51.2 512
  134 99.99 999
  149 34.9 349