ACCESSION: MSBNK-Fac_Eng_Univ_Tokyo-JP003248
RECORD_TITLE: GAMMA-HEXACHLORO-CYCLOHEXANE; EI-B; MS
DATE: 2016.01.19 (Created 2008.10.21, modified 2011.05.06)
AUTHORS: MASS SPECTROSCOPY SOC. OF JAPAN (MSSJ)
LICENSE: CC BY-NC-SA

CH$NAME: GAMMA-HEXACHLORO-CYCLOHEXANE
CH$COMPOUND_CLASS: N/A
CH$FORMULA: C6H6Cl6
CH$EXACT_MASS: 287.86007
CH$SMILES: [C@@H]1([C@@H]([C@@H]([C@H]([C@@H]([C@@H]1Cl)Cl)Cl)Cl)Cl)Cl
CH$IUPAC: InChI=1S/C6H6Cl6/c7-1-2(8)4(10)6(12)5(11)3(1)9/h1-6H/t1-,2-,3-,4+,5+,6+
CH$LINK: INCHIKEY JLYXXMFPNIAWKQ-GNIYUCBRSA-N

AC$INSTRUMENT: HITACHI RMU-6E
AC$INSTRUMENT_TYPE: EI-B
AC$MASS_SPECTROMETRY: MS_TYPE MS
AC$MASS_SPECTROMETRY: ION_MODE POSITIVE
AC$MASS_SPECTROMETRY: IONIZATION_ENERGY 70 eV

MS$FOCUSED_ION: ION_TYPE [M]+*

PK$SPLASH: splash10-00lr-0970000000-33cb78a0afe7fa116f26
PK$NUM_PEAK: 20
PK$PEAK: m/z int. rel.int.
  109 75 750
  111 66 660
  113 16 160
  149 30 300
  181 97 970
  183 91 910
  185 32 320
  217 80 800
  219 99.99 999
  221 49 490
  223 12 120
  252 14 140
  254 22 220
  256 16 160
  258 4 40
  288 7 70
  290 12 120
  292 8 80
  294 5 50
  296 4 40