ACCESSION: MSBNK-Fac_Eng_Univ_Tokyo-JP003169
RECORD_TITLE: GLUTETHIMIDE; CI-B; MS
DATE: 2016.01.19 (Created 2008.10.21, modified 2011.05.06)
AUTHORS: YOSHIZUMI H, FAC. OF PHARMACY, MEIJO UNIV.
LICENSE: CC BY-NC-SA

CH$NAME: GLUTETHIMIDE
CH$COMPOUND_CLASS: N/A
CH$FORMULA: C13H15NO2
CH$EXACT_MASS: 217.11028
CH$SMILES: CCC(C2)(C(=O)NC(=O)C2)c(c1)cccc1
CH$IUPAC: InChI=1S/C13H15NO2/c1-2-13(10-6-4-3-5-7-10)9-8-11(15)14-12(13)16/h3-7H,2,8-9H2,1H3,(H,14,15,16)
CH$LINK: INCHIKEY JMBQKKAJIKAWKF-UHFFFAOYSA-N
CH$LINK: COMPTOX DTXSID1023102

AC$INSTRUMENT: Unknown
AC$INSTRUMENT_TYPE: CI-B
AC$MASS_SPECTROMETRY: MS_TYPE MS
AC$MASS_SPECTROMETRY: ION_MODE POSITIVE
AC$MASS_SPECTROMETRY: REAGENT_GAS ISOBUTANE

PK$SPLASH: splash10-014i-0090000000-df13dd29711d257fd7b0
PK$NUM_PEAK: 4
PK$PEAK: m/z int. rel.int.
  189 1 10
  218 99.99 999
  219 15 150
  220 1 10