ACCESSION: MSBNK-Fac_Eng_Univ_Tokyo-JP002244
RECORD_TITLE: N-(TERT-BUTYL)-2-HEPTANIMINE; EI-B; MS
DATE: 2016.01.19 (Created 2008.10.21, modified 2011.05.06)
AUTHORS: MASS SPECTROSCOPY SOC. OF JAPAN (MSSJ)
LICENSE: CC BY-NC-SA

CH$NAME: N-(TERT-BUTYL)-2-HEPTANIMINE
CH$COMPOUND_CLASS: N/A
CH$FORMULA: C11H23N
CH$EXACT_MASS: 169.18305
CH$SMILES: CCCCCC(C)=NC(C)(C)C
CH$IUPAC: InChI=1S/C11H23N/c1-6-7-8-9-10(2)12-11(3,4)5/h6-9H2,1-5H3/b12-10-
CH$LINK: INCHIKEY MVGGGQZIXGZLBW-BENRWUELSA-N

AC$INSTRUMENT: JEOL JMS-D-3000
AC$INSTRUMENT_TYPE: EI-B
AC$MASS_SPECTROMETRY: MS_TYPE MS
AC$MASS_SPECTROMETRY: ION_MODE POSITIVE
AC$MASS_SPECTROMETRY: IONIZATION_ENERGY 70 eV

MS$FOCUSED_ION: ION_TYPE [M]+*

PK$SPLASH: splash10-0a4l-9100000000-ebbb62aa1098c4a41794
PK$NUM_PEAK: 24
PK$PEAK: m/z int. rel.int.
  41 46.11 461
  42 32.28 323
  43 32.45 325
  53 1.82 18
  54 1.62 16
  55 13.45 135
  56 10.86 109
  57 99.99 999
  58 43.7 437
  59 5.24 52
  69 1.06 11
  70 23.24 232
  71 11.27 113
  72 1.72 17
  82 1.72 17
  84 6.93 69
  96 1.48 15
  98 14.17 142
  99 1.82 18
  113 16.72 167
  114 6.62 66
  126 4.17 42
  154 10.34 103
  169 1.44 14