ACCESSION: MSBNK-Fac_Eng_Univ_Tokyo-JP001975
RECORD_TITLE: PARA-NITROPHENYLPENTAMETHYLDISILANE; EI-B; MS
DATE: 2016.01.19 (Created 2008.10.21, modified 2011.05.06)
AUTHORS: MASS SPECTROSCOPY SOC. OF JAPAN (MSSJ)
LICENSE: CC BY-NC-SA

CH$NAME: PARA-NITROPHENYLPENTAMETHYLDISILANE
CH$COMPOUND_CLASS: N/A
CH$FORMULA: C11H19NO2Si2
CH$EXACT_MASS: 253.09543
CH$SMILES: [O-1][N+1](=O)c(c1)ccc(c1)[Si](C)(C)[Si](C)(C)C
CH$IUPAC: InChI=1S/C11H19NO2Si2/c1-15(2,3)16(4,5)11-8-6-10(7-9-11)12(13)14/h6-9H,1-5H3
CH$LINK: INCHIKEY JBRHXSPSFSQEFQ-UHFFFAOYSA-N

AC$INSTRUMENT: JEOL JMS-D-3000
AC$INSTRUMENT_TYPE: EI-B
AC$MASS_SPECTROMETRY: MS_TYPE MS
AC$MASS_SPECTROMETRY: ION_MODE POSITIVE
AC$MASS_SPECTROMETRY: IONIZATION_ENERGY 70 eV

MS$FOCUSED_ION: ION_TYPE [M]+*

PK$SPLASH: splash10-00e9-6900000000-5c2dadfdfc0b6b7ac03b
PK$NUM_PEAK: 58
PK$PEAK: m/z int. rel.int.
  53 3.72 37
  55 1.89 19
  57 1.04 10
  58 2.96 30
  59 4.35 44
  67 1.97 20
  69 1.69 17
  72 1.38 14
  73 99.99 999
  74 9.53 95
  75 7.64 76
  77 1.15 12
  79 1.11 11
  83 3.79 38
  90 1.43 14
  91 1.35 14
  93 4.12 41
  99 1.04 10
  103 1.47 15
  104 1.65 17
  105 2.1 21
  107 1.46 15
  117 1.41 14
  119 18.48 185
  120 3.03 30
  121 2.25 23
  122 1.99 20
  131 4.12 41
  132 1.25 13
  133 7.58 76
  134 40.37 404
  135 7.16 72
  136 2.03 20
  145 1.1 11
  147 4.69 47
  148 1.41 14
  149 4.7 47
  150 8.33 83
  151 1.74 17
  158 3.61 36
  164 18.63 186
  165 3.29 33
  175 1.33 13
  177 1.65 17
  179 14.59 146
  180 13.02 130
  181 2.44 24
  192 1.35 14
  193 19.76 198
  194 4.27 43
  195 2.04 20
  207 7.12 71
  208 3.08 31
  222 1.69 17
  223 1.68 17
  238 5.45 55
  239 1.24 12
  253 1.03 10