ACCESSION: MSBNK-Fac_Eng_Univ_Tokyo-JP001376
RECORD_TITLE: (3,5-DI-TERT-BUTYLPHENYL)TRIMETHYLSILANE; EI-B; MS
DATE: 2016.01.19 (Created 2008.10.21, modified 2011.05.06)
AUTHORS: MASS SPECTROSCOPY SOC. OF JAPAN (MSSJ)
LICENSE: CC BY-NC-SA

CH$NAME: (3,5-DI-TERT-BUTYLPHENYL)TRIMETHYLSILANE
CH$COMPOUND_CLASS: N/A
CH$FORMULA: C17H30Si
CH$EXACT_MASS: 262.21168
CH$SMILES: CC(C)(C)c(c1)cc(cc1C(C)(C)C)[Si](C)(C)C
CH$IUPAC: InChI=1S/C17H30Si/c1-16(2,3)13-10-14(17(4,5)6)12-15(11-13)18(7,8)9/h10-12H,1-9H3
CH$LINK: INCHIKEY ZVCPSTJBKOWAOL-UHFFFAOYSA-N

AC$INSTRUMENT: JEOL JMS-D-3000
AC$INSTRUMENT_TYPE: EI-B
AC$MASS_SPECTROMETRY: MS_TYPE MS
AC$MASS_SPECTROMETRY: ION_MODE POSITIVE
AC$MASS_SPECTROMETRY: IONIZATION_ENERGY 70 eV

MS$FOCUSED_ION: ION_TYPE [M]+*

PK$SPLASH: splash10-0002-2090000000-1a71fda8d38eac52e92e
PK$NUM_PEAK: 18
PK$PEAK: m/z int. rel.int.
  45 2.32 23
  57 8.6 86
  59 3.56 36
  73 25.28 253
  74 2.14 21
  75 1.18 12
  102 5.54 55
  116 4.6 46
  117 1.12 11
  175 2.6 26
  215 1.24 12
  231 4.16 42
  232 1.46 15
  247 99.99 999
  248 23.88 239
  249 6.33 63
  262 11.88 119
  263 3.09 31