ACCESSION: MSBNK-Fac_Eng_Univ_Tokyo-JP001286
RECORD_TITLE: N,N-DIETHYLANILINE; EI-B; MS
DATE: 2016.01.19 (Created 2008.10.21, modified 2011.05.06)
AUTHORS: TAJIMA S, GUNMA COLLEGE OF TECHNOLOGY
LICENSE: CC BY-NC-SA

CH$NAME: N,N-DIETHYLANILINE
CH$COMPOUND_CLASS: N/A
CH$FORMULA: C10H15N
CH$EXACT_MASS: 149.12045
CH$SMILES: CCN(CC)c(c1)cccc1
CH$IUPAC: InChI=1S/C10H15N/c1-3-11(4-2)10-8-6-5-7-9-10/h5-9H,3-4H2,1-2H3
CH$LINK: INCHIKEY GGSUCNLOZRCGPQ-UHFFFAOYSA-N
CH$LINK: COMPTOX DTXSID8021800

AC$INSTRUMENT: HITACHI RMU-7M
AC$INSTRUMENT_TYPE: EI-B
AC$MASS_SPECTROMETRY: MS_TYPE MS
AC$MASS_SPECTROMETRY: ION_MODE POSITIVE
AC$MASS_SPECTROMETRY: IONIZATION_ENERGY 70 eV

MS$FOCUSED_ION: ION_TYPE [M]+*

PK$SPLASH: splash10-001i-2900000000-d2c4f5ccc7dd768ad007
PK$NUM_PEAK: 25
PK$PEAK: m/z int. rel.int.
  27 3.81 38
  28 2.11 21
  29 4.37 44
  39 2.32 23
  42 1.76 18
  50 1.13 11
  51 8.17 82
  52 1.13 11
  65 2.18 22
  77 22.83 228
  78 3.38 34
  79 6.55 66
  91 3.38 34
  104 7.4 74
  105 3.24 32
  106 47.36 474
  107 3.38 34
  118 2.54 25
  119 2.11 21
  120 4.37 44
  134 99.99 999
  135 9.58 96
  148 2.75 28
  149 28.61 286
  150 2.89 29