ACCESSION: MSBNK-Fac_Eng_Univ_Tokyo-JP001103
RECORD_TITLE: PARA-ISOPROPYLBENZOIC ACID TRIMETHYLSILYLESTER; EI-B; MS
DATE: 2016.01.19 (Created 2008.10.21, modified 2011.05.06)
AUTHORS: KOGA M, UNIV. OF OCCUPATIONAL AND ENVIRONMENTAL HEALTH
LICENSE: CC BY-NC-SA

CH$NAME: PARA-ISOPROPYLBENZOIC ACID TRIMETHYLSILYLESTER
CH$NAME: TRIMETHYLSILYL 4-ISOPROPYLBENZOATE
CH$COMPOUND_CLASS: N/A
CH$FORMULA: C13H20O2Si
CH$EXACT_MASS: 236.12326
CH$SMILES: N/A
CH$IUPAC: N/A

AC$INSTRUMENT: JEOL JMS-01-SG
AC$INSTRUMENT_TYPE: EI-B
AC$MASS_SPECTROMETRY: MS_TYPE MS
AC$MASS_SPECTROMETRY: ION_MODE POSITIVE
AC$MASS_SPECTROMETRY: IONIZATION_ENERGY 70 eV

MS$FOCUSED_ION: ION_TYPE [M]+*

PK$SPLASH: splash10-00dj-5790000000-4148609bff07a41bfbed
PK$NUM_PEAK: 13
PK$PEAK: m/z int. rel.int.
  45 15.8 158
  73 23.1 231
  75 7.9 79
  77 1.64 16
  91 13.4 134
  103 15.2 152
  147 58.5 585
  177 5.49 55
  178 7.3 73
  193 6 60
  221 99.99 999
  222 1.82 18
  236 6 60