ACCESSION: MSBNK-GL_Sciences_Inc-GLS00108
RECORD_TITLE: Gentistic acid; EI-B; MS; 3 TMS; RT: 724.56 s
DATE: 2016.01.19 (Created 2012.08.03, modified 2013.07.31)
AUTHORS: Miyagawa H, Akimoto S, Yamasaki K, GL Sciences Inc.
LICENSE: CC BY-SA
COPYRIGHT: GLS
COMMENT: The chemical compound was chemically modified with N-methyl-N-trimethylsilyl-trifluoroacetamide(MSTFA) before GC-MS analysis. When it has two or more functional groups, this modification gave a mixture of the TMS derivatives having different number of TMS groups at different functional groups.

CH$NAME: Gentistic acid
CH$NAME: Gentisic acid
CH$COMPOUND_CLASS: Natural Product
CH$FORMULA: C7H6O4
CH$EXACT_MASS: 154.02661
CH$SMILES: Oc(c1)cc(C(O)=O)c(O)c1
CH$IUPAC: InChI=1S/C7H6O4/c8-4-1-2-6(9)5(3-4)7(10)11/h1-3,8-9H,(H,10,11)
CH$LINK: CAS 490-79-9
CH$LINK: CHEBI 17189
CH$LINK: KEGG C00628
CH$LINK: PUBCHEM 3901
CH$LINK: INCHIKEY WXTMDXOMEHJXQO-UHFFFAOYSA-N
CH$LINK: COMPTOX DTXSID4060078

AC$INSTRUMENT: GCMS-2010 Plus, Shimadzu
AC$INSTRUMENT_TYPE: EI-B
AC$MASS_SPECTROMETRY: MS_TYPE MS
AC$MASS_SPECTROMETRY: ION_MODE POSITIVE
AC$MASS_SPECTROMETRY: GAS_PRESSURE 75 kPa
AC$MASS_SPECTROMETRY: ION_SOURCE_TEMPERATURE 200 C
AC$MASS_SPECTROMETRY: SCAN_RANGE_M/Z 85-500
AC$CHROMATOGRAPHY: COLUMN_NAME InertCap 5MS/NP 0.25 mmI.D. x 30 m, df=0.25 um
AC$CHROMATOGRAPHY: INJECTION_TEMPERATURE 230 C
AC$CHROMATOGRAPHY: OVEN_TEMPERATURE 80 C(2 min)-15 C/min - 330C
AC$CHROMATOGRAPHY: RETENTION_INDEX 1789
AC$CHROMATOGRAPHY: RETENTION_TIME 724.56
AC$CHROMATOGRAPHY: TRANSFARLINE_TEMPERATURE 250 C

MS$FOCUSED_ION: DERIVATIVE_TYPE 3 TMS
MS$DATA_PROCESSING: WHOLE GCMSsolution

PK$SPLASH: splash10-0a4i-0229000000-a4712abe7c7db86a97be
PK$NUM_PEAK: 382
PK$PEAK: m/z int. rel.int.
  86.100000 308.000000 1
  87.100000 1513.000000 2
  88.000000 274.000000 1
  89.050000 3099.000000 4
  90.050000 1178.000000 2
  91.050000 9341.000000 13
  92.050000 956.000000 1
  93.050000 3844.000000 5
  94.100000 519.000000 1
  95.100000 2681.000000 4
  96.100000 1454.000000 2
  97.100000 2036.000000 3
  98.100000 354.000000 1
  99.050000 1125.000000 2
  100.100000 631.000000 1
  101.100000 569.000000 1
  102.100000 727.000000 1
  103.050000 6581.000000 9
  104.100000 4422.000000 6
  105.100000 21679.000000 29
  106.100000 2534.000000 3
  107.100000 3449.000000 5
  108.100000 666.000000 1
  109.100000 3521.000000 5
  110.100000 388.000000 1
  111.050000 1265.000000 2
  112.100000 564.000000 1
  113.100000 638.000000 1
  114.100000 257.000000 1
  115.100000 5641.000000 8
  116.150000 1319.000000 2
  117.050000 5665.000000 8
  118.100000 1190.000000 2
  119.100000 8742.000000 12
  120.100000 1409.000000 2
  121.100000 4078.000000 5
  122.100000 810.000000 1
  123.100000 1564.000000 2
  124.100000 767.000000 1
  125.100000 455.000000 1
  126.100000 761.000000 1
  127.100000 1039.000000 1
  128.100000 1174.000000 2
  129.150000 3222.000000 4
  130.100000 681.000000 1
  131.100000 10866.000000 15
  132.150000 2069.000000 3
  133.100000 30489.000000 41
  134.100000 4830.000000 6
  135.100000 12871.000000 17
  136.150000 2000.000000 3
  137.100000 3882.000000 5
  138.100000 591.000000 1
  139.100000 542.000000 1
  140.100000 218.000000 1
  141.150000 2414.000000 3
  142.100000 550.000000 1
  143.150000 3035.000000 4
  144.100000 628.000000 1
  145.150000 2941.000000 4
  146.200000 682.000000 1
  147.150000 34668.000000 47
  148.150000 6126.000000 8
  149.150000 47861.000000 64
  150.150000 6940.000000 9
  151.100000 5516.000000 7
  152.150000 1085.000000 1
  153.200000 951.000000 1
  154.200000 124.000000 1
  155.200000 594.000000 1
  156.200000 217.000000 1
  157.100000 1492.000000 2
  158.100000 356.000000 1
  159.150000 1267.000000 2
  160.100000 345.000000 1
  161.100000 3684.000000 5
  162.100000 975.000000 1
  163.150000 11693.000000 16
  164.100000 2735.000000 4
  165.100000 4022.000000 5
  166.100000 836.000000 1
  167.100000 2524.000000 3
  168.100000 388.000000 1
  169.100000 894.000000 1
  170.100000 594.000000 1
  171.100000 415.000000 1
  172.100000 151.000000 1
  173.100000 426.000000 1
  174.100000 166.000000 1
  175.100000 966.000000 1
  176.100000 441.000000 1
  177.100000 4761.000000 6
  178.100000 1753.000000 2
  179.100000 8142.000000 11
  180.150000 1743.000000 2
  181.100000 2399.000000 3
  182.100000 631.000000 1
  183.100000 409.000000 1
  184.100000 122.000000 1
  185.100000 292.000000 1
  186.100000 175.000000 1
  187.100000 508.000000 1
  188.100000 132.000000 1
  189.100000 1866.000000 3
  190.100000 521.000000 1
  191.100000 7138.000000 10
  192.100000 1854.000000 2
  193.100000 9708.000000 13
  194.050000 2229.000000 3
  195.100000 5985.000000 8
  196.100000 1596.000000 2
  197.100000 874.000000 1
  198.100000 121.000000 1
  199.100000 182.000000 1
  200.100000 33.000000 1
  201.100000 214.000000 1
  202.100000 158.000000 1
  203.100000 1327.000000 2
  204.100000 262.000000 1
  205.100000 1638.000000 2
  206.100000 972.000000 1
  207.100000 12175.000000 16
  208.050000 5024.000000 7
  209.050000 9509.000000 13
  210.050000 1902.000000 3
  211.100000 2057.000000 3
  212.100000 290.000000 1
  213.100000 268.000000 1
  214.100000 74.000000 1
  215.100000 177.000000 1
  216.100000 68.000000 1
  217.100000 626.000000 1
  218.100000 268.000000 1
  219.050000 1417.000000 2
  220.100000 494.000000 1
  221.050000 5137.000000 7
  222.150000 1745.000000 2
  223.100000 39585.000000 53
  224.100000 8737.000000 12
  225.100000 12191.000000 16
  226.050000 2424.000000 3
  227.100000 911.000000 1
  228.100000 194.000000 1
  229.100000 169.000000 1
  230.100000 36.000000 1
  231.100000 434.000000 1
  232.100000 303.000000 1
  233.100000 1694.000000 2
  234.100000 436.000000 1
  235.100000 1785.000000 2
  236.150000 1020.000000 1
  237.100000 13695.000000 18
  238.100000 3730.000000 5
  239.150000 6490.000000 9
  240.150000 1521.000000 2
  241.200000 726.000000 1
  242.200000 143.000000 1
  243.200000 154.000000 1
  244.200000 74.000000 1
  245.200000 265.000000 1
  246.100000 271.000000 1
  247.100000 2658.000000 4
  248.100000 633.000000 1
  249.100000 9870.000000 13
  250.100000 2457.000000 3
  251.100000 6657.000000 9
  252.150000 2217.000000 3
  253.050000 3897.000000 5
  254.050000 985.000000 1
  255.000000 594.000000 1
  256.000000 103.000000 1
  257.000000 54.000000 1
  258.000000 60.000000 1
  259.000000 174.000000 1
  260.000000 132.000000 1
  261.000000 705.000000 1
  262.200000 354.000000 1
  263.150000 9005.000000 12
  264.150000 2383.000000 3
  265.150000 15227.000000 20
  266.150000 3742.000000 5
  267.100000 36030.000000 48
  268.100000 8212.000000 11
  269.100000 3770.000000 5
  270.100000 898.000000 1
  271.100000 220.000000 1
  272.100000 106.000000 1
  273.100000 24.000000 1
  274.100000 41.000000 1
  275.100000 130.000000 1
  276.100000 84.000000 1
  277.100000 450.000000 1
  278.100000 214.000000 1
  279.150000 3593.000000 5
  280.250000 2267.000000 3
  281.200000 32543.000000 44
  282.150000 12568.000000 17
  283.150000 6144.000000 8
  284.150000 1506.000000 2
  285.100000 545.000000 1
  286.100000 118.000000 1
  287.100000 135.000000 1
  289.100000 247.000000 1
  290.100000 190.000000 1
  291.100000 361.000000 1
  292.100000 150.000000 1
  293.100000 602.000000 1
  294.100000 201.000000 1
  295.150000 1415.000000 2
  296.200000 690.000000 1
  297.150000 47404.000000 64
  298.150000 14543.000000 20
  299.100000 7897.000000 11
  300.150000 1648.000000 2
  301.200000 575.000000 1
  302.200000 135.000000 1
  303.200000 289.000000 1
  304.200000 140.000000 1
  305.200000 713.000000 1
  306.200000 305.000000 1
  307.200000 881.000000 1
  308.200000 246.000000 1
  309.150000 1186.000000 2
  310.100000 356.000000 1
  311.150000 1099.000000 1
  312.200000 678.000000 1
  313.200000 6166.000000 8
  314.150000 2195.000000 3
  315.300000 1081.000000 1
  316.300000 385.000000 1
  318.300000 26.000000 1
  319.300000 178.000000 1
  320.200000 47.000000 1
  321.150000 6323.000000 8
  322.150000 1727.000000 2
  323.150000 1530.000000 2
  324.200000 466.000000 1
  325.200000 524.000000 1
  326.200000 330.000000 1
  327.200000 73.000000 1
  328.200000 21.000000 1
  329.200000 74.000000 1
  330.200000 2.000000 1
  331.200000 29.000000 1
  332.200000 73.000000 1
  333.200000 6.000000 1
  335.200000 170.000000 1
  336.200000 174.000000 1
  337.200000 19678.000000 26
  338.150000 6407.000000 9
  339.150000 3887.000000 5
  340.100000 988.000000 1
  341.100000 890.000000 1
  342.100000 140.000000 1
  343.100000 138.000000 1
  344.100000 65.000000 1
  345.100000 18.000000 1
  346.100000 130.000000 1
  347.100000 30.000000 1
  348.100000 81.000000 1
  349.100000 129.000000 1
  350.100000 79.000000 1
  351.100000 70.000000 1
  352.100000 98.000000 1
  353.150000 2218.000000 3
  354.250000 7619.000000 10
  355.200000 744538.000000 999
  356.200000 225495.000000 303
  357.200000 109678.000000 147
  358.150000 23776.000000 32
  359.200000 6142.000000 8
  360.200000 1202.000000 2
  361.200000 273.000000 1
  362.200000 169.000000 1
  364.200000 102.000000 1
  365.200000 111.000000 1
  367.200000 38.000000 1
  368.200000 94.000000 1
  369.250000 955.000000 1
  370.250000 24234.000000 33
  371.200000 7783.000000 10
  372.200000 4111.000000 6
  373.200000 858.000000 1
  374.200000 364.000000 1
  375.200000 18.000000 1
  376.200000 33.000000 1
  377.200000 22.000000 1
  379.200000 36.000000 1
  380.200000 108.000000 1
  381.200000 108.000000 1
  382.200000 8.000000 1
  383.200000 52.000000 1
  385.200000 97.000000 1
  387.200000 100.000000 1
  388.200000 105.000000 1
  389.200000 42.000000 1
  390.200000 127.000000 1
  393.200000 16.000000 1
  395.200000 142.000000 1
  396.200000 36.000000 1
  397.200000 62.000000 1
  398.200000 42.000000 1
  399.200000 74.000000 1
  400.200000 121.000000 1
  403.200000 19.000000 1
  404.200000 47.000000 1
  405.200000 97.000000 1
  406.200000 84.000000 1
  407.200000 70.000000 1
  408.200000 6.000000 1
  409.200000 42.000000 1
  410.200000 41.000000 1
  411.200000 14.000000 1
  412.200000 22.000000 1
  413.200000 122.000000 1
  414.200000 90.000000 1
  415.200000 30.000000 1
  416.200000 110.000000 1
  417.200000 62.000000 1
  418.200000 63.000000 1
  419.200000 50.000000 1
  420.200000 103.000000 1
  421.200000 29.000000 1
  422.200000 60.000000 1
  423.200000 21.000000 1
  424.200000 24.000000 1
  425.200000 16.000000 1
  426.200000 49.000000 1
  427.200000 10.000000 1
  429.200000 74.000000 1
  431.200000 46.000000 1
  432.200000 47.000000 1
  433.200000 82.000000 1
  434.200000 27.000000 1
  435.200000 52.000000 1
  436.200000 44.000000 1
  438.200000 8.000000 1
  440.200000 21.000000 1
  442.200000 105.000000 1
  443.200000 73.000000 1
  444.200000 58.000000 1
  445.200000 30.000000 1
  447.200000 24.000000 1
  450.200000 55.000000 1
  453.200000 62.000000 1
  454.200000 44.000000 1
  455.200000 49.000000 1
  456.200000 2.000000 1
  457.200000 46.000000 1
  458.200000 29.000000 1
  459.200000 98.000000 1
  460.200000 60.000000 1
  462.200000 47.000000 1
  463.200000 13.000000 1
  464.200000 3.000000 1
  465.200000 31.000000 1
  466.200000 46.000000 1
  468.200000 8.000000 1
  469.200000 10.000000 1
  470.200000 63.000000 1
  471.200000 95.000000 1
  473.200000 13.000000 1
  474.200000 122.000000 1
  475.200000 105.000000 1
  476.200000 16.000000 1
  478.200000 27.000000 1
  479.200000 92.000000 1
  480.200000 71.000000 1
  482.200000 5.000000 1
  483.200000 8.000000 1
  484.200000 47.000000 1
  485.200000 118.000000 1
  486.200000 73.000000 1
  487.200000 57.000000 1
  488.200000 11.000000 1
  489.200000 34.000000 1
  493.200000 46.000000 1
  494.200000 62.000000 1
  495.200000 62.000000 1
  497.200000 110.000000 1
  498.200000 29.000000 1
  499.200000 103.000000 1