ACCESSION: MSBNK-PFOS_research_group-FFF00209
RECORD_TITLE: Dihydrotestosterone; LC-APPI-QQ; MS2; CE:40 V; [M+H]+
DATE: 2016.01.19 (Created 2011.04.05, modified 2011.06.20)
AUTHORS: Atsushi Yamamoto, PFOS.jp
LICENSE: CC BY-SA
COPYRIGHT: PFOS.jp
COMMENT: Disclaimer: While authors make an effort to ensure that the content of this record is accurate, the authors make no representations or warranties in relation to the accuracy or completeness of the record. This record do not reflect any viewpoints of the affiliation and organization to which the authors belong.

CH$NAME: Dihydrotestosterone
CH$COMPOUND_CLASS: Natural Product; Steroid hormone
CH$FORMULA: C19H30O2
CH$EXACT_MASS: 290.22458
CH$SMILES: O=C(C4)CC([H])(C3)C(C)(C4)C(C2)C(C3)C(C1)C(C)(C2)C(O)C1
CH$IUPAC: InChI=1S/C19H30O2/c1-18-9-7-13(20)11-12(18)3-4-14-15-5-6-17(21)19(15,2)10-8-16(14)18/h12,14-17,21H,3-11H2,1-2H3/t12-,14?,15?,16?,17-,18?,19?/m0/s1
CH$LINK: CAS 521-18-6
CH$LINK: LIPIDBANK SST0297
CH$LINK: INCHIKEY NVKAWKQGWWIWPM-FMFZMMAASA-N

AC$INSTRUMENT: API2000
AC$INSTRUMENT_TYPE: LC-APPI-QQ
AC$MASS_SPECTROMETRY: MS_TYPE MS2
AC$MASS_SPECTROMETRY: ION_MODE POSITIVE
AC$CHROMATOGRAPHY: RETENTION_TIME 0.820850 min

MS$FOCUSED_ION: BASE_PEAK 273.299988
MS$FOCUSED_ION: PRECURSOR_M/Z 291.300000
MS$FOCUSED_ION: PRECURSOR_TYPE [M+H]+

PK$SPLASH: splash10-0a59-4960000000-198640655f9a7dc09be5
PK$NUM_PEAK: 344
PK$PEAK: m/z int. rel.int.
  42.099998 1350.500000 15
  42.400002 1350.500000 15
  43.175000 10804.000000 119
  43.500000 1350.500000 15
  45.599998 1350.500000 15
  54.400002 1350.500000 15
  55.066666 16206.000000 179
  57.050001 5402.000000 60
  58.099998 2701.000000 30
  64.800003 1350.500000 15
  65.300003 5402.000000 60
  66.400002 2701.000000 30
  67.250000 21608.000000 239
  67.699997 1350.500000 15
  68.500000 1350.500000 15
  69.099998 8103.000000 89
  69.599998 1350.500000 15
  69.900002 1350.500000 15
  70.099998 1350.500000 15
  70.938462 17556.500000 194
  72.300003 1350.500000 15
  73.099998 2701.000000 30
  76.400002 1350.500000 15
  76.800003 4051.500000 45
  77.000000 4051.500000 45
  77.300003 4051.500000 45
  77.699997 1350.500000 15
  78.099998 2701.000000 30
  79.006249 21608.000000 239
  79.599998 4051.500000 45
  80.099998 1350.500000 15
  81.183672 66174.500000 731
  82.300003 1350.500000 15
  82.944445 12154.500000 134
  84.250000 2701.000000 30
  84.825003 5402.000000 60
  85.099998 6752.500000 75
  85.350002 2701.000000 30
  86.000000 1350.500000 15
  89.500000 1350.500000 15
  89.699997 2701.000000 30
  90.000000 1350.500000 15
  90.961539 17556.500000 194
  91.199997 18907.000000 209
  92.179999 13505.000000 149
  92.836366 29711.000000 328
  93.228571 75628.000000 835
  93.800003 1350.500000 15
  94.300003 5402.000000 60
  95.071641 90483.500000 999
  96.250000 5402.000000 60
  97.174999 10804.000000 119
  97.500000 5402.000000 60
  98.350002 2701.000000 30
  98.800003 4051.500000 45
  99.350002 13505.000000 149
  100.300003 2701.000000 30
  100.850002 2701.000000 30
  101.199997 2701.000000 30
  102.900002 1350.500000 15
  104.199997 4051.500000 45
  105.091665 64824.000000 716
  106.099998 4051.500000 45
  106.400002 6752.500000 75
  107.049999 37814.000000 417
  108.199997 2701.000000 30
  109.189189 49968.500000 552
  110.300003 5402.000000 60
  110.500000 1350.500000 15
  110.850002 8103.000000 89
  111.099998 6752.500000 75
  111.699997 1350.500000 15
  114.800003 1350.500000 15
  115.199997 1350.500000 15
  115.599998 1350.500000 15
  116.400002 1350.500000 15
  116.599998 1350.500000 15
  116.983334 8103.000000 89
  117.800003 1350.500000 15
  118.099998 1350.500000 15
  118.400002 5402.000000 60
  119.018182 29711.000000 328
  119.950001 2701.000000 30
  120.400002 1350.500000 15
  121.166664 24309.000000 268
  121.699997 1350.500000 15
  122.500000 4051.500000 45
  122.957144 18907.000000 209
  123.300003 1350.500000 15
  124.000000 1350.500000 15
  124.400002 1350.500000 15
  124.950001 2701.000000 30
  126.900002 1350.500000 15
  127.599998 1350.500000 15
  128.000000 1350.500000 15
  128.399999 4051.500000 45
  129.000000 10804.000000 119
  129.500000 1350.500000 15
  129.800003 1350.500000 15
  130.000000 1350.500000 15
  130.199997 6752.500000 75
  130.399994 1350.500000 15
  130.899994 16206.000000 179
  132.000000 1350.500000 15
  132.600006 5402.000000 60
  133.122220 48618.000000 537
  133.800003 1350.500000 15
  134.050003 2701.000000 30
  134.349998 2701.000000 30
  135.162498 21608.000000 239
  135.800003 1350.500000 15
  136.800003 2701.000000 30
  137.000000 1350.500000 15
  137.250000 2701.000000 30
  139.699997 1350.500000 15
  140.699997 1350.500000 15
  140.899994 1350.500000 15
  141.100006 4051.500000 45
  142.399997 6752.500000 75
  142.936361 14855.500000 164
  143.399994 4051.500000 45
  143.800003 1350.500000 15
  144.892852 18907.000000 209
  145.204543 29711.000000 328
  146.000000 2701.000000 30
  146.300003 2701.000000 30
  146.600006 1350.500000 15
  146.949997 21608.000000 239
  147.316664 32412.000000 358
  148.100006 2701.000000 30
  148.699997 4051.500000 45
  149.000000 4051.500000 45
  150.300003 1350.500000 15
  150.899994 4051.500000 45
  151.100006 2701.000000 30
  152.899994 2701.000000 30
  153.100006 2701.000000 30
  153.300003 2701.000000 30
  153.899994 1350.500000 15
  154.300003 1350.500000 15
  154.949997 2701.000000 30
  155.250000 2701.000000 30
  155.500000 2701.000000 30
  155.800003 1350.500000 15
  156.300003 2701.000000 30
  156.750000 5402.000000 60
  157.100006 4051.500000 45
  157.399994 4051.500000 45
  157.899994 2701.000000 30
  158.366664 8103.000000 89
  159.166667 64824.000000 716
  159.899994 2701.000000 30
  161.165625 43216.000000 477
  162.600006 1350.500000 15
  163.100006 2701.000000 30
  163.449997 2701.000000 30
  164.000000 4051.500000 45
  164.300003 1350.500000 15
  164.849998 5402.000000 60
  165.500000 1350.500000 15
  166.199997 1350.500000 15
  167.199997 1350.500000 15
  168.300003 1350.500000 15
  168.650002 2701.000000 30
  169.000000 1350.500000 15
  169.399994 2701.000000 30
  169.600006 1350.500000 15
  170.000000 1350.500000 15
  170.500000 1350.500000 15
  170.699997 5402.000000 60
  171.000000 8103.000000 89
  171.800003 1350.500000 15
  172.600006 6752.500000 75
  173.081818 44566.500000 492
  174.300003 4051.500000 45
  174.600006 2701.000000 30
  175.100003 13505.000000 149
  175.800003 1350.500000 15
  176.133336 8103.000000 89
  176.949997 2701.000000 30
  177.199997 1350.500000 15
  177.449997 2701.000000 30
  177.899994 2701.000000 30
  178.500000 5402.000000 60
  178.800003 2701.000000 30
  179.325001 5402.000000 60
  179.699997 1350.500000 15
  180.199997 1350.500000 15
  180.399994 4051.500000 45
  180.899994 1350.500000 15
  181.399994 1350.500000 15
  183.150002 2701.000000 30
  183.399994 4051.500000 45
  183.899994 1350.500000 15
  184.100006 2701.000000 30
  185.237499 10804.000000 119
  186.100006 2701.000000 30
  187.000000 9453.500000 104
  187.800003 4051.500000 45
  188.050003 2701.000000 30
  188.300003 1350.500000 15
  188.600006 1350.500000 15
  189.241666 32412.000000 358
  189.766668 8103.000000 89
  190.100006 5402.000000 60
  190.300003 4051.500000 45
  191.185717 18907.000000 209
  192.000000 5402.000000 60
  192.449997 2701.000000 30
  193.050003 2701.000000 30
  193.349998 2701.000000 30
  194.300003 1350.500000 15
  194.500000 1350.500000 15
  194.800003 1350.500000 15
  195.000000 1350.500000 15
  195.300003 1350.500000 15
  195.500000 1350.500000 15
  196.500000 1350.500000 15
  196.699997 1350.500000 15
  197.000000 2701.000000 30
  197.250000 2701.000000 30
  198.150002 2701.000000 30
  199.300003 14855.500000 164
  200.000000 1350.500000 15
  200.199997 1350.500000 15
  200.449997 2701.000000 30
  200.699997 1350.500000 15
  201.199997 12154.500000 134
  201.600006 5402.000000 60
  202.172729 29711.000000 328
  202.933329 16206.000000 179
  203.244444 24309.000000 268
  204.000000 4051.500000 45
  204.300003 5402.000000 60
  205.000000 5402.000000 60
  205.428569 9453.500000 104
  205.899994 2701.000000 30
  206.100006 1350.500000 15
  206.349998 2701.000000 30
  206.600006 1350.500000 15
  206.966665 8103.000000 89
  207.199997 2701.000000 30
  207.399994 4051.500000 45
  207.800003 1350.500000 15
  208.100006 1350.500000 15
  208.899994 1350.500000 15
  210.899994 2701.000000 30
  211.100006 1350.500000 15
  211.300003 1350.500000 15
  211.500000 1350.500000 15
  212.199997 1350.500000 15
  213.271430 18907.000000 209
  213.500000 4051.500000 45
  214.100006 1350.500000 15
  214.449997 2701.000000 30
  215.241666 32412.000000 358
  215.500000 17556.500000 194
  215.800003 2701.000000 30
  216.000000 9453.500000 104
  216.600006 4051.500000 45
  217.263636 14855.500000 164
  217.699997 2701.000000 30
  217.899994 1350.500000 15
  218.250000 5402.000000 60
  219.159999 27010.000000 298
  219.600006 1350.500000 15
  220.299995 16206.000000 179
  221.000000 2701.000000 30
  221.250000 8103.000000 89
  221.500000 1350.500000 15
  222.000000 2701.000000 30
  222.800003 1350.500000 15
  223.100006 2701.000000 30
  224.100006 1350.500000 15
  225.750000 2701.000000 30
  226.150002 2701.000000 30
  226.399994 1350.500000 15
  227.000000 2701.000000 30
  227.500000 1350.500000 15
  229.374996 5402.000000 60
  229.600006 4051.500000 45
  229.933329 8103.000000 89
  230.399994 4051.500000 45
  231.189998 13505.000000 149
  231.449997 13505.000000 149
  232.139999 13505.000000 149
  232.941663 16206.000000 179
  233.199997 9453.500000 104
  233.600006 4051.500000 45
  234.166667 8103.000000 89
  235.144446 24309.000000 268
  238.899994 1350.500000 15
  239.600006 2701.000000 30
  239.899994 1350.500000 15
  240.449997 2701.000000 30
  240.899994 2701.000000 30
  241.150002 2701.000000 30
  241.500000 1350.500000 15
  242.000000 1350.500000 15
  243.000000 2701.000000 30
  243.199997 4051.500000 45
  243.800003 1350.500000 15
  244.000000 2701.000000 30
  244.300003 2701.000000 30
  245.275002 10804.000000 119
  245.600006 6752.500000 75
  246.299995 5402.000000 60
  247.224998 10804.000000 119
  248.129628 36463.500000 403
  248.800003 4051.500000 45
  249.000000 5402.000000 60
  249.399994 2701.000000 30
  254.500000 1350.500000 15
  254.699997 1350.500000 15
  255.275002 16206.000000 179
  257.500000 1350.500000 15
  257.899994 1350.500000 15
  258.200012 2701.000000 30
  258.449997 2701.000000 30
  259.263641 14855.500000 164
  259.600006 2701.000000 30
  259.899994 2701.000000 30
  260.100006 1350.500000 15
  260.500000 4051.500000 45
  261.200012 8103.000000 89
  261.700012 2701.000000 30
  261.899994 4051.500000 45
  262.399994 2701.000000 30
  262.985713 18907.000000 209
  263.299988 6752.500000 75
  272.200012 1350.500000 15
  272.899994 2701.000000 30
  273.274994 10804.000000 119
  273.699997 5402.000000 60
  274.799988 2701.000000 30
  275.200012 5402.000000 60
  275.600006 5402.000000 60
  276.171996 33762.500000 373
  276.799988 2701.000000 30
  289.349991 2701.000000 30
  290.000000 1350.500000 15
  290.449997 2701.000000 30
  291.299992 18907.000000 209
  291.849991 2701.000000 30