ACCESSION: MSBNK-PFOS_research_group-FFF00038
RECORD_TITLE: Cholestanol; LC-APPI-QQ; MS2; CE:40 V; [M-H2O+H]+
DATE: 2016.01.19 (Created 2011.01.24, modified 2011.06.20)
AUTHORS: Atsushi Yamamoto, PFOS.jp
LICENSE: CC BY-SA
COPYRIGHT: PFOS.jp
COMMENT: Disclaimer: While authors make an effort to ensure that the content of this record is accurate, the authors make no representations or warranties in relation to the accuracy or completeness of the record. This record do not reflect any viewpoints of the affiliation and organization to which the authors belong.

CH$NAME: Cholestanol
CH$COMPOUND_CLASS: Natural Product; Sterol
CH$FORMULA: C27H48O
CH$EXACT_MASS: 388.37052
CH$SMILES: C(C)(C1)(C(C(C)CCCC(C)C)4)C(CC4)C(C2)C(C(C)(C3)C([H])(CC(C3)O)C2)C1
CH$IUPAC: InChI=1S/C27H48O/c1-18(2)7-6-8-19(3)23-11-12-24-22-10-9-20-17-21(28)13-15-26(20,4)25(22)14-16-27(23,24)5/h18-25,28H,6-17H2,1-5H3/t19?,20-,21-,22?,23?,24?,25?,26?,27?/m0/s1
CH$LINK: CAS 80-97-7
CH$LINK: LIPIDBANK SST0005
CH$LINK: INCHIKEY QYIXCDOBOSTCEI-JKUMBUQESA-N

AC$INSTRUMENT: API2000, Applied
AC$INSTRUMENT_TYPE: LC-APPI-QQ
AC$MASS_SPECTROMETRY: MS_TYPE MS2
AC$MASS_SPECTROMETRY: ION_MODE POSITIVE
AC$CHROMATOGRAPHY: RETENTION_TIME 0.820917 min

MS$FOCUSED_ION: BASE_PEAK 81.099998
MS$FOCUSED_ION: PRECURSOR_M/Z 371.451000
MS$FOCUSED_ION: PRECURSOR_TYPE [M-H2O+H]+

PK$SPLASH: splash10-0532-9700000000-18116d6d0d7645732013
PK$NUM_PEAK: 306
PK$PEAK: m/z int. rel.int.
  38.900002 3701.000000 1
  39.599998 1850.500000 1
  40.981818 20355.500000 2
  41.700001 1850.500000 1
  42.250000 7402.000000 1
  43.299999 29608.000000 3
  43.799999 1850.500000 1
  44.299999 1850.500000 1
  51.900002 1850.500000 1
  52.599998 1850.500000 1
  52.900000 5551.500000 1
  53.400002 3701.000000 1
  55.061755 590309.500000 59
  57.086270 808668.500000 81
  58.200001 1850.500000 1
  59.200001 1850.500000 1
  61.799999 1850.500000 1
  63.200001 1850.500000 1
  64.300003 1850.500000 1
  65.025000 14804.000000 1
  65.800003 12953.500000 1
  67.071366 1706161.000000 170
  69.068585 2603653.500000 260
  70.099998 14804.000000 1
  71.098913 680984.000000 68
  71.800003 5551.500000 1
  72.099998 1850.500000 1
  72.599998 5551.500000 1
  73.025000 7402.000000 1
  73.400002 1850.500000 1
  76.000000 1850.500000 1
  76.500000 5551.500000 1
  77.008000 46262.500000 5
  77.525000 7402.000000 1
  77.900002 9252.500000 1
  79.016666 555150.000000 55
  81.084325 7059657.500000 704
  83.095190 2538886.000000 253
  84.099998 7402.000000 1
  84.300003 16654.500000 2
  85.125806 229462.000000 23
  85.900002 1850.500000 1
  86.300003 5551.500000 1
  87.199997 1850.500000 1
  87.500000 1850.500000 1
  88.800003 3701.000000 1
  90.000000 3701.000000 1
  91.093163 216508.500000 22
  91.764706 31458.500000 3
  93.072374 2237254.500000 223
  95.038308 10018607.000000 999
  97.107243 1584028.000000 158
  98.599998 1850.500000 1
  99.099998 20355.500000 2
  99.400002 3701.000000 1
  99.699997 1850.500000 1
  100.199997 1850.500000 1
  100.800003 1850.500000 1
  101.199999 11103.000000 1
  102.699997 1850.500000 1
  103.199997 3701.000000 1
  103.450001 3701.000000 1
  105.050000 399708.000000 40
  107.015520 2313125.000000 231
  109.077678 6184371.000000 617
  111.037904 458924.000000 46
  113.099998 5551.500000 1
  113.300003 1850.500000 1
  115.149998 3701.000000 1
  116.000000 1850.500000 1
  116.300003 1850.500000 1
  116.549999 3701.000000 1
  116.900002 9252.500000 1
  117.724998 7402.000000 1
  118.074999 7402.000000 1
  119.057576 244266.000000 24
  119.715384 48113.000000 5
  121.077097 2294620.000000 229
  123.059931 2142879.000000 214
  124.000000 5551.500000 1
  124.400002 5551.500000 1
  124.900000 70319.000000 7
  127.000000 5551.500000 1
  127.500000 1850.500000 1
  128.600006 1850.500000 1
  129.000000 5551.500000 1
  129.500000 3701.000000 1
  129.800003 3701.000000 1
  130.199997 1850.500000 1
  130.399994 3701.000000 1
  131.170000 18505.000000 2
  131.600006 5551.500000 1
  133.116130 344193.000000 34
  135.072989 3082933.000000 307
  137.139221 618067.000000 62
  137.800003 3701.000000 1
  139.075005 7402.000000 1
  139.500000 1850.500000 1
  141.000000 1850.500000 1
  142.699997 3701.000000 1
  143.000000 1850.500000 1
  143.199997 1850.500000 1
  143.500000 1850.500000 1
  144.199997 1850.500000 1
  144.699997 5551.500000 1
  145.000000 25907.000000 3
  145.399994 12953.500000 1
  147.119903 762406.000000 76
  149.124105 2533334.500000 253
  151.124109 207256.000000 21
  152.699997 1850.500000 1
  153.000000 3701.000000 1
  153.399994 3701.000000 1
  156.500000 1850.500000 1
  156.750000 7402.000000 1
  157.899994 1850.500000 1
  158.199997 1850.500000 1
  158.550003 3701.000000 1
  158.899994 12953.500000 1
  161.116379 429316.000000 43
  161.762501 14804.000000 1
  163.126395 995569.000000 99
  164.399994 7402.000000 1
  165.102223 166545.000000 17
  166.100006 1850.500000 1
  167.300003 1850.500000 1
  168.899994 1850.500000 1
  170.100006 1850.500000 1
  170.799995 7402.000000 1
  171.199997 1850.500000 1
  172.199997 1850.500000 1
  173.200001 14804.000000 1
  174.000000 7402.000000 1
  175.091945 275724.500000 27
  176.300003 5551.500000 1
  177.196461 418213.000000 42
  179.199997 77721.000000 8
  180.250000 3701.000000 1
  183.300003 1850.500000 1
  184.300003 1850.500000 1
  184.600006 1850.500000 1
  185.199997 3701.000000 1
  185.399994 1850.500000 1
  185.800003 1850.500000 1
  186.699997 3701.000000 1
  187.316668 11103.000000 1
  188.183332 11103.000000 1
  189.157714 647675.000000 65
  190.200002 5551.500000 1
  191.120338 218359.000000 22
  192.000000 1850.500000 1
  192.199997 1850.500000 1
  192.500000 1850.500000 1
  193.097223 133236.000000 13
  195.300003 1850.500000 1
  197.000000 1850.500000 1
  198.899994 3701.000000 1
  199.100006 1850.500000 1
  199.399994 1850.500000 1
  200.199997 1850.500000 1
  200.699997 1850.500000 1
  201.100006 5551.500000 1
  201.300003 5551.500000 1
  201.500000 1850.500000 1
  201.899994 1850.500000 1
  202.199997 5551.500000 1
  203.212430 327538.500000 33
  204.199997 3701.000000 1
  205.111365 162844.000000 16
  206.300003 1850.500000 1
  207.195349 79571.500000 8
  207.500000 24056.500000 2
  212.000000 1850.500000 1
  212.899994 1850.500000 1
  213.100006 1850.500000 1
  213.550003 7402.000000 1
  214.500000 1850.500000 1
  214.874996 7402.000000 1
  215.125004 14804.000000 1
  215.449997 14804.000000 1
  216.100006 16654.500000 2
  216.330000 18505.000000 2
  217.167998 92525.000000 9
  219.147619 77721.000000 8
  219.427268 40711.000000 4
  220.300003 1850.500000 1
  220.800003 11103.000000 1
  221.342104 35159.500000 4
  227.050003 3701.000000 1
  227.500000 1850.500000 1
  228.899994 1850.500000 1
  229.299998 5551.500000 1
  229.899994 3701.000000 1
  230.250000 7402.000000 1
  230.916662 33309.000000 3
  231.294447 33309.000000 3
  231.600006 12953.500000 1
  232.100006 3701.000000 1
  233.210417 88824.000000 9
  234.100006 1850.500000 1
  234.849998 3701.000000 1
  235.375000 14804.000000 1
  237.300003 1850.500000 1
  239.399994 1850.500000 1
  240.699997 3701.000000 1
  241.500000 1850.500000 1
  242.600006 1850.500000 1
  242.800003 1850.500000 1
  243.050003 3701.000000 1
  243.550003 3701.000000 1
  243.949997 3701.000000 1
  244.500000 1850.500000 1
  244.966665 22206.000000 2
  245.312500 29608.000000 3
  246.150002 3701.000000 1
  246.399994 1850.500000 1
  247.267567 136937.000000 14
  249.050003 7402.000000 1
  249.399994 3701.000000 1
  249.750000 3701.000000 1
  251.199997 1850.500000 1
  254.699997 1850.500000 1
  255.899994 1850.500000 1
  257.399994 1850.500000 1
  257.799988 3701.000000 1
  258.100006 7402.000000 1
  258.550003 7402.000000 1
  258.899994 18505.000000 2
  259.322857 64767.500000 6
  260.349991 3701.000000 1
  260.600006 3701.000000 1
  261.297297 136937.000000 14
  262.500000 3701.000000 1
  263.300003 7402.000000 1
  263.600006 3701.000000 1
  264.899994 1850.500000 1
  265.100006 1850.500000 1
  265.299988 1850.500000 1
  266.700012 1850.500000 1
  267.100006 1850.500000 1
  267.299988 1850.500000 1
  267.600006 1850.500000 1
  268.799988 1850.500000 1
  269.000000 1850.500000 1
  269.399994 1850.500000 1
  271.200012 3701.000000 1
  272.250000 3701.000000 1
  273.128579 25907.000000 3
  273.500000 20355.500000 2
  273.899994 1850.500000 1
  274.600006 3701.000000 1
  275.319997 55515.000000 6
  276.500000 1850.500000 1
  277.399994 1850.500000 1
  281.500000 1850.500000 1
  283.100006 1850.500000 1
  283.600006 1850.500000 1
  283.899994 1850.500000 1
  284.799988 1850.500000 1
  285.000000 1850.500000 1
  285.200012 3701.000000 1
  285.399994 3701.000000 1
  286.200012 1850.500000 1
  287.083338 22206.000000 2
  287.399994 14804.000000 1
  288.799988 1850.500000 1
  289.000000 9252.500000 1
  289.200012 12953.500000 1
  292.899994 1850.500000 1
  293.100006 1850.500000 1
  293.600006 1850.500000 1
  294.299988 1850.500000 1
  295.200012 1850.500000 1
  297.000000 1850.500000 1
  299.700012 1850.500000 1
  300.100006 3701.000000 1
  300.799988 1850.500000 1
  301.000000 5551.500000 1
  301.333323 16654.500000 2
  303.100006 5551.500000 1
  303.299988 3701.000000 1
  303.600006 3701.000000 1
  303.799988 1850.500000 1
  311.399994 1850.500000 1
  312.200012 1850.500000 1
  312.899994 1850.500000 1
  314.000000 1850.500000 1
  314.550003 3701.000000 1
  315.600006 18505.000000 2
  316.100006 3701.000000 1
  327.399994 1850.500000 1
  328.299998 5551.500000 1
  328.600006 1850.500000 1
  329.100006 5551.500000 1
  329.500000 1850.500000 1
  329.700012 3701.000000 1
  341.799988 1850.500000 1
  342.100006 1850.500000 1
  352.899994 1850.500000 1
  353.100006 5551.500000 1
  353.500000 1850.500000 1
  356.100006 1850.500000 1
  356.299988 1850.500000 1
  356.600006 3701.000000 1
  370.250000 3701.000000 1
  371.515127 220209.500000 22