ACCESSION: MSBNK-RIKEN_NPDepo-CB000101
RECORD_TITLE: Palmatine; LC-ESI-QQQ; MS; [M+H]+
DATE: 2018.04.04
AUTHORS: Nogawa T, Okano A, CSRS, RIKEN
LICENSE: CC BY
COMMENT: Origin: Plant
COMMENT: Formula(Parent): C21H22NO4
COMMENT: Bottle Name:Palmatine chloride
COMMENT: PRIME Parent Name:Palmatine
COMMENT: PRIME in-house No.:V0288
COMMENT: SubCategory_DNP: Isoquinoline alkaloids, Benzylisoquinoline alkaloids

CH$NAME: Palmatin
CH$NAME: Berbericine
CH$NAME: 2,3,9,10-Tetramethoxyprotoberberin
CH$NAME: O,O-Dimethyldemethyleneberberine
CH$NAME: Palmatine
CH$COMPOUND_CLASS: Alkaloids
CH$FORMULA: C21H22NO4+
CH$EXACT_MASS: 352.4138
CH$SMILES: COc1cc2c(cc1OC)-c1cc3ccc(OC)c(OC)c3c[n+]1CC2
CH$IUPAC: InChI=1S/C21H22NO4/c1-23-18-6-5-13-9-17-15-11-20(25-3)19(24-2)10-14(15)7-8-22(17)12-16(13)21(18)26-4/h5-6,9-12H,7-8H2,1-4H3/q+1
CH$LINK: CAS 3486-67-7
CH$LINK: CHEMSPIDER 17947
CH$LINK: INCHIKEY QUCQEUCGKKTEBI-UHFFFAOYSA-N
CH$LINK: COMPTOX DTXSID9048065
CH$LINK: PUBCHEM CID:19009

AC$INSTRUMENT: ABSciex API3200 LC/MS system
AC$INSTRUMENT_TYPE: LC-ESI-QQQ
AC$MASS_SPECTROMETRY: MS_TYPE MS
AC$MASS_SPECTROMETRY: ION_MODE POSITIVE

MS$FOCUSED_ION: PRECURSOR_TYPE [M]+

PK$SPLASH: splash10-0udi-0009000000-4fd3376500713d58b6e8
PK$NUM_PEAK: 187
PK$PEAK: m/z int. rel.int.
  290.5000 385527.5313 31
  290.6000 440864.7500 36
  290.7000 477367.4688 39
  290.8000 635545.2500 53
  290.9000 497702.1563 41
  291.0000 628211.5625 52
  291.1000 437031.2188 36
  291.2000 852227.5000 71
  291.3000 1059242.5000 89
  291.4000 781055.7500 65
  291.5000 885896.6250 74
  291.6000 943233.9375 79
  291.7000 759554.1875 63
  291.8000 679548.5000 56
  291.9000 981403.3125 82
  292.0000 989237.2500 83
  292.1000 719551.3750 60
  292.2000 996737.7500 83
  292.3000 670547.6875 56
  292.4000 560373.2500 46
  292.5000 521370.5313 43
  292.6000 734885.8125 61
  292.7000 547039.0000 45
  292.8000 511703.1875 42
  292.9000 413529.5000 34
  293.0000 535204.9375 44
  293.1000 300854.7813 24
  293.2000 429864.0000 35
  293.3000 471200.3125 39
  293.4000 539871.8125 44
  293.5000 738719.3125 61
  293.6000 929233.0000 77
  293.7000 989737.3125 83
  293.8000 923732.5625 77
  293.9000 1103411.8750 92
  294.0000 1145081.7500 96
  294.1000 811057.8125 67
  294.2000 1022906.4375 85
  294.3000 683882.1250 57
  294.4000 660380.5625 55
  294.5000 336523.9688 27
  306.6000 291687.5000 23
  306.7000 353358.5625 29
  306.8000 329190.1875 26
  306.9000 354858.6563 29
  307.0000 417696.4375 34
  307.1000 347358.0938 28
  307.2000 284853.6563 23
  307.3000 364526.0625 29
  307.4000 1516774.7500 127
  307.5000 3040717.0000 257
  307.6000 3633759.5000 307
  307.7000 3823606.2500 324
  307.8000 4063290.5000 344
  307.9000 4002619.0000 339
  308.0000 3727432.5000 315
  308.1000 3629259.2500 307
  308.2000 3454580.0000 292
  308.3000 3185727.2500 269
  308.4000 2798700.0000 236
  308.5000 1316094.0000 110
  308.6000 1269924.0000 106
  308.7000 1420434.6250 119
  308.8000 1037907.5000 87
  308.9000 1108912.5000 93
  309.0000 1032240.4375 86
  309.1000 1081077.2500 90
  309.2000 1068076.1250 89
  309.3000 959068.3750 80
  309.4000 664380.6250 55
  319.3000 289854.0000 23
  319.4000 860394.7500 72
  319.5000 1378931.7500 116
  319.6000 1767792.8750 149
  319.7000 1605948.1250 135
  319.8000 1962306.7500 165
  319.9000 2580850.7500 218
  320.0000 1987975.3750 168
  320.1000 1652117.7500 139
  320.2000 1782127.0000 150
  320.3000 1403766.7500 118
  320.4000 1415601.0000 119
  320.5000 1093411.3750 91
  320.6000 900397.5000 75
  320.7000 656213.3750 54
  320.8000 758720.8125 63
  320.9000 735719.0625 61
  321.0000 875229.1250 73
  321.1000 546538.9375 45
  321.2000 674048.1250 56
  321.3000 755553.8750 63
  321.4000 1201918.8750 101
  321.5000 1876967.2500 158
  321.6000 2475843.7500 209
  321.7000 2358334.5000 199
  321.8000 2504512.0000 211
  321.9000 2412172.2500 204
  322.0000 2130152.0000 180
  322.1000 2172488.2500 183
  322.2000 1557611.2500 131
  322.3000 1816963.0000 153
  322.4000 1194085.2500 100
  322.5000 620377.5625 51
  322.6000 556373.0000 46
  322.7000 434030.9375 35
  322.8000 409029.2500 33
  322.9000 447198.5938 37
  323.0000 372193.2813 30
  323.1000 372026.5625 30
  323.2000 334023.8750 27
  323.3000 412029.4063 34
  333.7000 268519.2188 21
  335.3000 537371.6875 44
  335.4000 2255160.7500 190
  335.5000 4521656.5000 383
  335.6000 5135200.5000 435
  335.7000 5844250.5000 495
  335.8000 5364716.0000 455
  335.9000 5026692.0000 426
  336.0000 5046694.5000 428
  336.1000 5272877.0000 447
  336.2000 5221539.5000 442
  336.3000 4961187.0000 420
  336.4000 5454389.5000 462
  336.5000 6046432.0000 513
  336.6000 6465128.0000 548
  336.7000 6688310.0000 567
  336.8000 6441459.5000 546
  336.9000 6861989.0000 582
  337.0000 5865752.0000 497
  337.1000 5866418.0000 497
  337.2000 5808415.0000 492
  337.3000 5449388.5000 462
  337.4000 4637831.5000 393
  337.5000 2437007.0000 206
  337.6000 2750196.0000 232
  337.7000 1940304.7500 163
  337.8000 1859299.5000 157
  337.9000 2940042.5000 248
  338.0000 4416816.0000 374
  338.1000 1561277.8750 131
  338.2000 1556777.6250 131
  338.3000 1302926.2500 109
  338.4000 1130080.5000 95
  338.5000 451532.1875 37
  338.6000 418863.1875 34
  338.7000 594542.3750 49
  338.9000 372693.2500 30
  339.1000 303688.3438 24
  351.2000 664380.7500 55
  351.3000 5226039.5000 443
  351.4000 11508321.0000 977
  351.5000 11360978.0000 964
  351.6000 11131294.0000 945
  351.7000 10860107.0000 922
  351.8000 11626331.0000 987
  351.9000 11666001.0000 990
  352.0000 11762508.0000 999
  352.1000 11681667.0000 992
  352.2000 11448150.0000 972
  352.3000 11240803.0000 954
  352.4000 10683927.0000 907
  352.5000 7357525.0000 624
  352.6000 7206014.0000 611
  352.7000 7324022.0000 621
  352.8000 6626305.5000 562
  352.9000 6894825.5000 585
  353.0000 6982997.0000 592
  353.1000 7032501.0000 596
  353.2000 6730314.5000 571
  353.3000 6442793.5000 546
  353.4000 6510297.0000 552
  353.5000 5239541.0000 444
  353.6000 2341000.0000 198
  353.7000 1842298.0000 155
  353.8000 1532276.0000 129
  353.9000 1583446.3750 133
  354.0000 1461104.3750 123
  354.1000 1886634.8750 159
  354.2000 1642783.6250 138
  354.3000 1378431.6250 116
  354.4000 1315760.5000 110
  354.5000 749220.1250 62
  354.6000 392694.6875 32
  354.7000 291687.5000 23
  354.8000 319356.1250 26
  354.9000 397695.0625 32