ACCESSION: MSBNK-Washington_State_Univ-BML80025
RECORD_TITLE: (-)-Menthyl lactate; LC-ESI-QTOF; MS; POSITIVE
DATE: 2016.01.19 (Created 2012.10.26)
AUTHORS: Cuthbertson DJ, Johnson SR, Lange BM, Institute of Biological Chemistry, Washington State University
LICENSE: CC BY-SA
COMMENT: relative retention time with respect to 9-anthracene Carboxylic Acid is 1.307

CH$NAME: (-)-Menthyl lactate
CH$COMPOUND_CLASS: N/A
CH$FORMULA: C13H24O3
CH$EXACT_MASS: 228.172545
CH$SMILES: C[C@@H]1CC[C@H]([C@@H](C1)OC(=O)C(C)O)C(C)C
CH$IUPAC: InChI=1S/C13H24O3/c1-8(2)11-6-5-9(3)7-12(11)16-13(15)10(4)14/h8-12,14H,5-7H2,1-4H3/t9-,10?,11+,12-/m1/s1
CH$LINK: CAS 59259-38-0
CH$LINK: CHEMSPIDER 55982
CH$LINK: PUBCHEM CID:62151
CH$LINK: INCHIKEY UJNOLBSYLSYIBM-SGUBAKSOSA-N

AC$INSTRUMENT: Agilent 1200 RRLC; Agilent 6520 QTOF
AC$INSTRUMENT_TYPE: LC-ESI-QTOF
AC$MASS_SPECTROMETRY: MS_TYPE MS
AC$MASS_SPECTROMETRY: ION_MODE POSITIVE
AC$MASS_SPECTROMETRY: SCANNING m/z 100-1000
AC$CHROMATOGRAPHY: COLUMN_NAME Agilent C8 Cartridge Column 2.1X30mm 3.5 micron (guard); Agilent SB-Aq 2.1x50mm 1.8 micron (analytical)
AC$CHROMATOGRAPHY: COLUMN_TEMPERATURE 60 C
AC$CHROMATOGRAPHY: FLOW_GRADIENT linear from 98A/2B at 0 min to 2A/98B at 13 min, hold 6 min at 2A/98B, reequilibration 98A/2B (5 min)
AC$CHROMATOGRAPHY: FLOW_RATE 0.6 ml/min
AC$CHROMATOGRAPHY: RETENTION_TIME 9.576
AC$CHROMATOGRAPHY: SOLVENT A water with 0.2% acetic acid
AC$CHROMATOGRAPHY: SOLVENT B methanol with 0.2% acetic acid

PK$SPLASH: splash10-0udi-0090000000-581486d100a80120f7ac
PK$NUM_PEAK: 1
PK$PEAK: m/z int. rel.int.
  251.161718 88241 999